BDBM527540 US11186587, Example 23
SMILES COc1ccccc1C(Cn1c2sc(c(C)c2c(=O)n(c1=O)C(C)(C)C(O)=O)-c1ncco1)OC1CN(C1)C(C)=O
InChI Key InChIKey=XNEBZWUQYFQBGE-UHFFFAOYSA-N
Data  1 IC50
  Tab Delimited (TSV)   2D SDfile   Computed 3D by Vconf -m prep SDfile
Find this compound or compounds like it in BindingDB:
Activity Spreadsheet -- Enzyme Inhibition Constant Data from BindingDB
Found 1 hit for monomerid = 527540
TargetAcetyl-CoA carboxylase 1(Homo sapiens (Human))
Nanjing Sanhome Pharmaceutical
US Patent
LigandPNGBDBM527540(US11186587, Example 23)
Affinity DataIC50:  11.5nM. Assay description: 4.5 μL of 2.2×ACC1 enzyme (2 nM) working solution was added to a 384-well plate; and then 0.5 μL of different concentrations of compound we...
Ligand InfoPC cidPC sid
In DepthDetails US Patent