BDBM527885 (3S,4S)-3-methyl- 8-(8-(thieno[2,3- b]pyridin-4- ylthio)imidazo[1,2-c] pyrimidin-5-yl)- 2-oxa-8- azaspiro[4.5]decan- 4-amine::US11179397, Example 102
SMILES C[C@@H]1OCC2(CCN(CC2)c2ncc(Sc3ccnc4sccc34)c3nccn23)[C@@H]1N
InChI Key InChIKey=VKPKLLVMDFEPPV-KBXCAEBGSA-N
Data  1 IC50
  Tab Delimited (TSV)   2D SDfile   Computed 3D by Vconf -m prep SDfile
Find this compound or compounds like it in BindingDB:
Activity Spreadsheet -- Enzyme Inhibition Constant Data from BindingDB
Found 1 hit for monomerid = 527885
TargetTyrosine-protein phosphatase non-receptor type 11(Homo sapiens (Human))
Gilead Sciences
US Patent
LigandPNGBDBM527885((3S,4S)-3-methyl- 8-(8-(thieno[2,3- b]pyridin-4- y...)
Affinity DataIC50:  4nM. Assay description: Inhibition of SHP-2 activity by small molecule inhibitors was monitored by a biochemical DiFMUP pseudosubstrate-fluorogenic assay. SHP-2 enzyme at fi...
Ligand InfoPC cidPC sid
In DepthDetails US Patent