BDBM527925 (S)-1'-(8-((1,5- naphthyridin-4- yl)thio)imidazo[1,2- c]pyrimidin-5-yl)- 1,3- dihydrospiro[indene- 2,4'-piperidin]- 1-amine::US11179397, Example 144
SMILES N[C@@H]1c2ccccc2CC11CCN(CC1)c1ncc(Sc2ccnc3cccnc23)c2nccn12
InChI Key InChIKey=KYLPUEIXQNBJRN-XMMPIXPASA-N
Data  1 IC50
  Tab Delimited (TSV)   2D SDfile   Computed 3D by Vconf -m prep SDfile
Find this compound or compounds like it in BindingDB:
Activity Spreadsheet -- Enzyme Inhibition Constant Data from BindingDB
Found 1 hit for monomerid = 527925
TargetTyrosine-protein phosphatase non-receptor type 11(Homo sapiens (Human))
Gilead Sciences
US Patent
LigandPNGBDBM527925((S)-1'-(8-((1,5- naphthyridin-4- yl)thio)imidazo[1...)
Affinity DataIC50:  3.60nM. Assay description: Inhibition of SHP-2 activity by small molecule inhibitors was monitored by a biochemical DiFMUP pseudosubstrate-fluorogenic assay. SHP-2 enzyme at fi...
Ligand InfoPC cidPC sid
In DepthDetails US Patent