BDBM530893 (R)-2-(1-(4-(N-(3-amino- 2- hydroxypropyl)sulfamoyl)- 3-sulfamoyl-2-(2H- tetrazol-5- yl)phenyl)piperidin-4- yl)acetamide::US11207312, Example 25
SMILES NC[C@@H](O)CNS(=O)(=O)c1ccc(N2CCC(CC(N)=O)CC2)c(-c2nn[nH]n2)c1S(N)(=O)=O
InChI Key
Data  4 IC50
  Tab Delimited (TSV)   2D SDfile   Computed 3D by Vconf -m prep SDfile
Find this compound or compounds like it in BindingDB:
Activity Spreadsheet -- Enzyme Inhibition Constant Data from BindingDB
Found 4 hits for monomerid = 530893
TargetMetallo-beta-lactamase type 2(Klebsiella pneumoniae)
Merck Sharp & Dohme
US Patent
LigandPNGBDBM530893((R)-2-(1-(4-(N-(3-amino- 2- hydroxypropyl)sulfamoy...)
Affinity DataIC50:  0.540nM. Assay description: The Class B enzyme activities were measured in the presence of the test inhibitor in a fluorescence assay against a commercially available substrate ...
Ligand InfoPC cidPC sid
In DepthDetails US Patent
TargetMetallo-beta-lactamase VIM-2(Pseudomonas aeruginosa (g-Proteobacteria))
Merck Sharp & Dohme
US Patent
LigandPNGBDBM530893((R)-2-(1-(4-(N-(3-amino- 2- hydroxypropyl)sulfamoy...)
Affinity DataIC50:  0.740nM. Assay description: The Class B enzyme activities were measured in the presence of the test inhibitor in a fluorescence assay against a commercially available substrate ...
Ligand InfoPC cidPC sid
In DepthDetails US Patent
TargetVIM-1 metallo-beta-lactamase(Klebsiella pneumoniae)
Merck Sharp & Dohme
US Patent
LigandPNGBDBM530893((R)-2-(1-(4-(N-(3-amino- 2- hydroxypropyl)sulfamoy...)
Affinity DataIC50:  0.170nM. Assay description: The Class B enzyme activities were measured in the presence of the test inhibitor in a fluorescence assay against a commercially available substrate ...
Ligand InfoPC cidPC sid
In DepthDetails US Patent
TargetBeta-lactamase(Pseudomonas aeruginosa)
Merck Sharp & Dohme
US Patent
LigandPNGBDBM530893((R)-2-(1-(4-(N-(3-amino- 2- hydroxypropyl)sulfamoy...)
Affinity DataIC50:  0.390nM. Assay description: The Class B enzyme activities were measured in the presence of the test inhibitor in a fluorescence assay against a commercially available substrate ...
Ligand InfoPC cidPC sid
In DepthDetails US Patent