BDBM530913 N1-(1,3- diaminopropan-2- yl)-4-(4- (hydroxymethyl) piperidin-1-yl)-3- (1H-tetrazol-5- yl)benzene-1,2- disulfonamide::US11207312, Example 45
SMILES NCC(CN)NS(=O)(=O)c1ccc(N2CCC(CO)CC2)c(-c2nnn[nH]2)c1S(N)(=O)=O
InChI Key InChIKey=IKLQJYOBZMJSDZ-UHFFFAOYSA-N
Data  4 IC50
  Tab Delimited (TSV)   2D SDfile   Computed 3D by Vconf -m prep SDfile
Find this compound or compounds like it in BindingDB:
Activity Spreadsheet -- Enzyme Inhibition Constant Data from BindingDB
Found 4 hits for monomerid = 530913
TargetMetallo-beta-lactamase type 2(Klebsiella pneumoniae)
Merck Sharp & Dohme
US Patent
LigandPNGBDBM530913(N1-(1,3- diaminopropan-2- yl)-4-(4- (hydroxymethyl...)
Affinity DataIC50:  0.270nM. Assay description: The Class B enzyme activities were measured in the presence of the test inhibitor in a fluorescence assay against a commercially available substrate ...
Ligand InfoPC cidPC sid
In DepthDetails US Patent
TargetMetallo-beta-lactamase VIM-2(Pseudomonas aeruginosa (g-Proteobacteria))
Merck Sharp & Dohme
US Patent
LigandPNGBDBM530913(N1-(1,3- diaminopropan-2- yl)-4-(4- (hydroxymethyl...)
Affinity DataIC50:  0.740nM. Assay description: The Class B enzyme activities were measured in the presence of the test inhibitor in a fluorescence assay against a commercially available substrate ...
Ligand InfoPC cidPC sid
In DepthDetails US Patent
TargetVIM-1 metallo-beta-lactamase(Klebsiella pneumoniae)
Merck Sharp & Dohme
US Patent
LigandPNGBDBM530913(N1-(1,3- diaminopropan-2- yl)-4-(4- (hydroxymethyl...)
Affinity DataIC50:  0.230nM. Assay description: The Class B enzyme activities were measured in the presence of the test inhibitor in a fluorescence assay against a commercially available substrate ...
Ligand InfoPC cidPC sid
In DepthDetails US Patent
TargetBeta-lactamase(Pseudomonas aeruginosa)
Merck Sharp & Dohme
US Patent
LigandPNGBDBM530913(N1-(1,3- diaminopropan-2- yl)-4-(4- (hydroxymethyl...)
Affinity DataIC50:  0.520nM. Assay description: The Class B enzyme activities were measured in the presence of the test inhibitor in a fluorescence assay against a commercially available substrate ...
Ligand InfoPC cidPC sid
In DepthDetails US Patent