BDBM530957 4-[4- (fluoromethyl)piperidin-1- yl]-N1-[(3R)-pyrrolidin-3- yl]-3-(1H-tetrazol-5- yl)benzene-1,2- disulfonamide::US11207312, Example 89
SMILES NS(=O)(=O)c1c(ccc(N2CCC(CF)CC2)c1-c1nnn[nH]1)S(=O)(=O)N[C@@H]1CCNC1
InChI Key
Data  4 IC50
  Tab Delimited (TSV)   2D SDfile   Computed 3D by Vconf -m prep SDfile
Find this compound or compounds like it in BindingDB:
Activity Spreadsheet -- Enzyme Inhibition Constant Data from BindingDB
Found 4 hits for monomerid = 530957
TargetMetallo-beta-lactamase type 2(Klebsiella pneumoniae)
Merck Sharp & Dohme
US Patent
LigandPNGBDBM530957(4-[4- (fluoromethyl)piperidin-1- yl]-N1-[(3R)-pyrr...)
Affinity DataIC50:  0.210nM. Assay description: The Class B enzyme activities were measured in the presence of the test inhibitor in a fluorescence assay against a commercially available substrate ...
Ligand InfoPC cidPC sid
In DepthDetails US Patent
TargetMetallo-beta-lactamase VIM-2(Pseudomonas aeruginosa (g-Proteobacteria))
Merck Sharp & Dohme
US Patent
LigandPNGBDBM530957(4-[4- (fluoromethyl)piperidin-1- yl]-N1-[(3R)-pyrr...)
Affinity DataIC50:  0.660nM. Assay description: The Class B enzyme activities were measured in the presence of the test inhibitor in a fluorescence assay against a commercially available substrate ...
Ligand InfoPC cidPC sid
In DepthDetails US Patent
TargetVIM-1 metallo-beta-lactamase(Klebsiella pneumoniae)
Merck Sharp & Dohme
US Patent
LigandPNGBDBM530957(4-[4- (fluoromethyl)piperidin-1- yl]-N1-[(3R)-pyrr...)
Affinity DataIC50:  0.210nM. Assay description: The Class B enzyme activities were measured in the presence of the test inhibitor in a fluorescence assay against a commercially available substrate ...
Ligand InfoPC cidPC sid
In DepthDetails US Patent
TargetBeta-lactamase(Pseudomonas aeruginosa)
Merck Sharp & Dohme
US Patent
LigandPNGBDBM530957(4-[4- (fluoromethyl)piperidin-1- yl]-N1-[(3R)-pyrr...)
Affinity DataIC50:  0.610nM. Assay description: The Class B enzyme activities were measured in the presence of the test inhibitor in a fluorescence assay against a commercially available substrate ...
Ligand InfoPC cidPC sid
In DepthDetails US Patent