BDBM533462 US11220518, Ex. No. J9::US11780853, Example J9
SMILES COCc1ncc(F)c(Nc2n[nH]c3c2CN(C(=O)N2CC(C)(C)N(C)C[C@@H]2C)C3(C)C)n1
InChI Key
Data  2 KI
  Tab Delimited (TSV)   2D SDfile   Computed 3D by Vconf -m prep SDfile
Find this compound or compounds like it in BindingDB:
Activity Spreadsheet -- Enzyme Inhibition Constant Data from BindingDB
Found 2 hits for monomerid = 533462
TargetProtein kinase C beta type Isoform 2(Homo sapiens (Human))
Pfizer
US Patent
LigandPNGBDBM533462(US11220518, Ex. No. J9 | US11780853, Example J9)
Affinity DataKi:  2.10nM. Assay description: Protein Kinase C beta 2 (PKCpII) catalyzes the production of ADP from ATP that accompanies the phosphoryl transfer to the PKC Pseudosubstrate peptide...
Ligand InfoPC cidPC sid
In DepthDetails US Patent
TargetProtein kinase C beta type(Homo sapiens (Human))
Pfizer
US Patent
LigandPNGBDBM533462(US11220518, Ex. No. J9 | US11780853, Example J9)
Affinity DataKi:  2.10nM. Assay description: A typical assay was carried out on a 96-well, clear microtiter plate in a Molecular Devices spectrophotometer for 20 minutes at 30° C. in 0.1 mL of a...
Ligand InfoPC cidPC sid
In DepthDetails US Patent