BDBM550507 US11306105, Compound 300
SMILES COC(=O)C[C@@H]1N=C(c2c(C)c(CNS(=O)(=O)c3ccccc3)sc2-n2c(C)nnc12)c1ccc(Cl)cc1
InChI Key InChIKey=XLAWIKASUIIZGC-FQEVSTJZSA-N
Data  2 IC50
  Tab Delimited (TSV)   2D SDfile   Computed 3D by Vconf -m prep SDfile
Find this compound or compounds like it in BindingDB:
Activity Spreadsheet -- Enzyme Inhibition Constant Data from BindingDB
Found 2 hits for monomerid = 550507
TargetBromodomain-containing protein 4 [44-167](Homo sapiens (Human))
Dana-Farber Cancer Institute
US Patent
LigandPNGBDBM550507(US11306105, Compound 300)
Affinity DataIC50:  16nM. Assay description: Acetyl-Histone Binding Assay. Assays were performed as described previously with minor modifications from the manufacturer's protocol (PerkinElme...
Ligand InfoPC cidPC sid
In DepthDetails US Patent
TargetBromodomain testis-specific protein [22-138](Homo sapiens (Human))
Dana-Farber Cancer Institute
US Patent
LigandPNGBDBM550507(US11306105, Compound 300)
Affinity DataIC50:  60nM. Assay description: Acetyl-Histone Binding Assay. Assays were performed as described previously with minor modifications from the manufacturer's protocol (PerkinElme...
Ligand InfoPC cidPC sid
In DepthDetails US Patent