BDBM554453 US11332492, Example 2
SMILES O[C@@H]1[C@@H](COCP(O)(O)=O)O[C@H]([C@@H]1O)n1ncc2c(nc(Cl)nc12)N1CC2(C1)CCc1ccccc21
InChI Key InChIKey=NAHILNAHEKBGES-WOCWXWTJSA-N
Data  1 IC50
  Tab Delimited (TSV)   2D SDfile   Computed 3D by Vconf -m prep SDfile
Find this compound or compounds like it in BindingDB:
Activity Spreadsheet -- Enzyme Inhibition Constant Data from BindingDB
Found 1 hit for monomerid = 554453
Target5'-nucleotidase(Homo sapiens (Human))
Jiangsu Hengrui Medicine
US Patent
LigandPNGBDBM554453(US11332492, Example 2)
Affinity DataIC50:  0.0130nM. Assay description: I. Experimental Materials and Equipment1. Malachite green phosphate detection kit (R & D Systems, Cat #, DY996)2. Recombinant human 5′-nucleoti...
Ligand InfoPC cidPC sid
In DepthDetails US Patent