BDBM555122 3-[(3-fluoro-2-methoxyphenyl)amino]-2-[3-(2-methoxyethoxy)pyridin-4-yl]-1,5,6,7-tetrahydro-4H-pyrrolo[3,2-c]pyridin-4-one::US11339157, Example 16
SMILES COCCOc1cnccc1-c1[nH]c2CCNC(=O)c2c1Nc1cccc(F)c1OC
InChI Key InChIKey=RTNKDYCENDJQOW-UHFFFAOYSA-N
Data  2 IC50
  Tab Delimited (TSV)   2D SDfile   Computed 3D by Vconf -m prep SDfile
Find this compound or compounds like it in BindingDB:
Activity Spreadsheet -- Enzyme Inhibition Constant Data from BindingDB
Found 2 hits for monomerid = 555122
TargetEpidermal growth factor receptor [669-770,'SVD',771-1210](Homo sapiens (Human))
Bayer Aktiengesellschaft
US Patent
LigandPNGBDBM555122(3-[(3-fluoro-2-methoxyphenyl)amino]-2-[3-(2-methox...)
Affinity DataIC50:  0.212nM. Assay description: Exon 20-Mutant-EGFR(V769_D770insASV): For the assay 50 nl of a 100-fold concentrated solution of the test compound in DMSO was pipetted into either a...
Ligand InfoPC cidPC sid
In DepthDetails US Patent
TargetEpidermal growth factor receptor [669-770,'SVD',771-1210](Homo sapiens (Human))
Bayer Aktiengesellschaft
US Patent
LigandPNGBDBM555122(3-[(3-fluoro-2-methoxyphenyl)amino]-2-[3-(2-methox...)
Affinity DataIC50:  0.138nM. Assay description: Exon 20-Mutant-EGFR(D770_N771insSVD): For the assay 50 nl of a 100-fold concentrated solution of the test compound in DMSO was pipetted into either a...
Ligand InfoPC cidPC sid
In DepthDetails US Patent