BDBM558335 US11365192, Example 42-13
SMILES O=C(CCc1cccc(COc2ccc(nc2)-c2ccn[nH]2)c1)N1CCCC1
InChI Key InChIKey=XWZDFZMIVBZMCS-UHFFFAOYSA-N
Data  2 IC50
  Tab Delimited (TSV)   2D SDfile   Computed 3D by Vconf -m prep SDfile
Find this compound or compounds like it in BindingDB:
Activity Spreadsheet -- Enzyme Inhibition Constant Data from BindingDB
Found 2 hits for monomerid = 558335
TargetCytochrome P450 4A11(Homo sapiens)
Taisho Pharmaceutical
US Patent
LigandPNGBDBM558335(US11365192, Example 42-13)
Affinity DataIC50:  150nM. Assay description: In the CYP4F2 inhibition test, the reaction solution containing each compound [final concentration of 50 mM, KPO4 (pH 7.4), 2.5 μM luciferine de...
Ligand InfoPC cidPC sid
In DepthDetails US Patent
TargetCytochrome P450 4F2(Homo sapiens (Human))
Taisho Pharmaceutical
US Patent
LigandPNGBDBM558335(US11365192, Example 42-13)
Affinity DataIC50:  15nM. Assay description: In the CYP4F2 inhibition test, the reaction solution containing each compound [final concentration of 50 mM, KPO4 (pH 7.4), 2.5 μM luciferine de...
Ligand InfoPC cidPC sid
In DepthDetails US Patent