BDBM558876 US11370770, Compound 6aa
SMILES Clc1ccc2c(n[nH]c2c1)-c1ccc2OCOc2c1
InChI Key InChIKey=XHOXMKAWBCICCE-UHFFFAOYSA-N
Data  1 IC50
  Tab Delimited (TSV)   2D SDfile   Computed 3D by Vconf -m prep SDfile
Find this compound or compounds like it in BindingDB:
Activity Spreadsheet -- Enzyme Inhibition Constant Data from BindingDB
Found 1 hit for monomerid = 558876
TargetDual specificity mitogen-activated protein kinase kinase 4(Homo sapiens (Human))
Northwestern University
US Patent
LigandPNGBDBM558876(US11370770, Compound 6aa)
Affinity DataIC50:  460nM. Assay description: Kinase activity of recombinant active full-length human MEK4 (Carna Biosciences) was measured using the ADP-Glo assay (Promega) with 3 μM recomb...
Ligand InfoPC cidPC sid
In DepthDetails US Patent