BDBM558879 US11370770, Compound 6dd
SMILES COC(=O)c1ccc(cc1)-c1n[nH]c2cc(F)ccc12
InChI Key InChIKey=IEDHWGFYBSOPRB-UHFFFAOYSA-N
Data  1 IC50
  Tab Delimited (TSV)   2D SDfile   Computed 3D by Vconf -m prep SDfile
Find this compound or compounds like it in BindingDB:
Activity Spreadsheet -- Enzyme Inhibition Constant Data from BindingDB
Found 1 hit for monomerid = 558879
TargetDual specificity mitogen-activated protein kinase kinase 4(Homo sapiens (Human))
Northwestern University
US Patent
LigandPNGBDBM558879(US11370770, Compound 6dd)
Affinity DataIC50:  420nM. Assay description: Kinase activity of recombinant active full-length human MEK4 (Carna Biosciences) was measured using the ADP-Glo assay (Promega) with 3 μM recomb...
Ligand InfoPC cidPC sid
In DepthDetails US Patent