BDBM561951 6-[(Z)-2-(aminomethyl)-3-fluoro-allyloxy]-2-phenyl-3,4-dihydroisoquinolin-1-one::US11396495, No. 6
SMILES NC\C(COc1ccc2C(=O)N(CCc2c1)c1ccccc1)=C\F
InChI Key InChIKey=VLYZLMVWEKTRCI-KAMYIIQDSA-N
Data  1 IC50
  Tab Delimited (TSV)   2D SDfile   Computed 3D by Vconf -m prep SDfile
Find this compound or compounds like it in BindingDB:
Activity Spreadsheet -- Enzyme Inhibition Constant Data from BindingDB
Found 1 hit for monomerid = 561951
TargetMembrane primary amine oxidase(Homo sapiens (Human))
Sunshine Lake Pharma
US Patent
LigandPNGBDBM561951(6-[(Z)-2-(aminomethyl)-3-fluoro-allyloxy]-2-phenyl...)
Affinity DataIC50:  0.0400nM. Assay description: 1. Determination of Inhibitory Activity of Human Recombinant SSAO/VAP-1Test purpose: The following methods can be used to determine the inhibitory ac...
Ligand InfoPC cidPC sid
In DepthDetails US Patent