BDBM561952 6-[(E)-2-(aminomethyl)-3-fluoro-allyloxy]-2-(pyrimidin-2-yl)-3,4-dihydro isoquinolin-1-one::US11396495, No. 7
SMILES NC\C(COc1ccc2C(=O)N(CCc2c1)c1ncccn1)=C/F
InChI Key InChIKey=GBEKNWSVNUJVCW-FMIVXFBMSA-N
Data  1 IC50
  Tab Delimited (TSV)   2D SDfile   Computed 3D by Vconf -m prep SDfile
Find this compound or compounds like it in BindingDB:
Activity Spreadsheet -- Enzyme Inhibition Constant Data from BindingDB
Found 1 hit for monomerid = 561952
TargetMembrane primary amine oxidase(Homo sapiens (Human))
Sunshine Lake Pharma
US Patent
LigandPNGBDBM561952(6-[(E)-2-(aminomethyl)-3-fluoro-allyloxy]-2-(pyrim...)
Affinity DataIC50:  0.0900nM. Assay description: 1. Determination of Inhibitory Activity of Human Recombinant SSAO/VAP-1Test purpose: The following methods can be used to determine the inhibitory ac...
Ligand InfoPC cidPC sid
In DepthDetails US Patent