BDBM561953 6-[(E)-2-(aminomethyl)-3-fluoro-allyloxy]-2-methyl-3,4-dihydroisoquinolin-1-one::US11396495, No. 8
SMILES CN1CCc2cc(OC\C(CN)=C\F)ccc2C1=O
InChI Key InChIKey=FPPJLRPZPCYBCI-JXMROGBWSA-N
Data  1 IC50
  Tab Delimited (TSV)   2D SDfile   Computed 3D by Vconf -m prep SDfile
Find this compound or compounds like it in BindingDB:
Activity Spreadsheet -- Enzyme Inhibition Constant Data from BindingDB
Found 1 hit for monomerid = 561953
TargetMembrane primary amine oxidase(Homo sapiens (Human))
Sunshine Lake Pharma
US Patent
LigandPNGBDBM561953(6-[(E)-2-(aminomethyl)-3-fluoro-allyloxy]-2-methyl...)
Affinity DataIC50:  0.320nM. Assay description: 1. Determination of Inhibitory Activity of Human Recombinant SSAO/VAP-1Test purpose: The following methods can be used to determine the inhibitory ac...
Ligand InfoPC cidPC sid
In DepthDetails US Patent