BDBM564987 US11414395, Example 35
SMILES COc1ccnc(n1)-n1ncc2CC(CCc2c1=O)c1ccc(C)cc1C
InChI Key InChIKey=QARJHBHKIAEDEN-UHFFFAOYSA-N
Data  1 IC50
  Tab Delimited (TSV)   2D SDfile   Computed 3D by Vconf -m prep SDfile
Find this compound or compounds like it in BindingDB:
Activity Spreadsheet -- Enzyme Inhibition Constant Data from BindingDB
Found 1 hit for monomerid = 564987
TargetMetabotropic glutamate receptor 7(Homo sapiens (Human))
Pragma Therapeutics
US Patent
LigandPNGBDBM564987(US11414395, Example 35)
Affinity DataIC50: <500nM. Assay description: The HTRF-based assays from CisBio Bioassays allow the measure of different cell signaling pathways, notably those allowing the determination of the p...
Ligand InfoPC cidPC sid
In DepthDetails US Patent