BDBM565148 US11414404, Ex. # 25::US11634409, Example 25
SMILES Cc1c(Nc2c(F)ccc(NS(=O)(=O)c3cc(F)ccc3F)c2Cl)ccc2ncn(C)c(=O)c12
InChI Key InChIKey=PQJKRNATOHGZLI-UHFFFAOYSA-N
Data  2 IC50
  Tab Delimited (TSV)   2D SDfile   Computed 3D by Vconf -m prep SDfile
Find this compound or compounds like it in BindingDB:
Activity Spreadsheet -- Enzyme Inhibition Constant Data from BindingDB
Found 2 hits for monomerid = 565148
TargetSerine/threonine-protein kinase B-raf [V600E](Homo sapiens (Human))
Array Biopharma
US Patent
LigandPNGBDBM565148(US11414404, Ex. # 25 | US11634409, Example 25)
Affinity DataIC50:  0.340nM. Assay description: A competitive displacement assay was configured for B-Raf that monitors the amount of a fluorescently-tagged “tracer” bound to B-Raf via TR-FRET from...
Ligand InfoPC cidPC sid
In DepthDetails US Patent
TargetSerine/threonine-protein kinase B-raf [V600E](Homo sapiens (Human))
Array Biopharma
US Patent
LigandPNGBDBM565148(US11414404, Ex. # 25 | US11634409, Example 25)
Affinity DataIC50:  0.340nM. Assay description: A competitive displacement assay was configured for B-Raf that monitors the amount of a fluorescently-tagged “tracer” bound to B-Raf via TR-FRET from...
Ligand InfoPC cidPC sid
In DepthDetails US Patent