BDBM572097 (R)-N-(2-fluoro-4-(3-(quinazolin-2- ylamino)pyrrolidine-1- carbonyl)phenyl)acrylamide::US11447493, Example 62
SMILES Fc1cc(ccc1NC(=O)C=C)C(=O)N1CC[C@H](C1)Nc1ncc2ccccc2n1
InChI Key InChIKey=GYQGWMAYFQZINJ-MRXNPFEDSA-N
Data  6 IC50
  Tab Delimited (TSV)   2D SDfile   Computed 3D by Vconf -m prep SDfile
Find this compound or compounds like it in BindingDB:
Activity Spreadsheet -- Enzyme Inhibition Constant Data from BindingDB
Found 6 hits for monomerid = 572097
TargetCyclin-K/Cyclin-dependent kinase 12(Homo sapiens (Human))
Kinnate Biopharma
US Patent
LigandPNGBDBM572097((R)-N-(2-fluoro-4-(3-(quinazolin-2- ylamino)pyrrol...)
Affinity DataIC50: <100nM. Assay description: A radiometric protein kinase assay (33PanQinaseŽ Activity Assay) was used for measuring the kinase activity of the three protein kinases. All kinase ...
Ligand InfoPC cidPC sid
In DepthDetails US Patent
TargetCyclin-K/Cyclin-dependent kinase 12(Homo sapiens (Human))
Kinnate Biopharma
US Patent
LigandPNGBDBM572097((R)-N-(2-fluoro-4-(3-(quinazolin-2- ylamino)pyrrol...)
Affinity DataIC50: <100nM. Assay description: A radiometric protein kinase assay (33PanQinaseŽ Activity Assay) was used for measuring the kinase activity of the protein kinase. All kinase assays ...
Ligand InfoPC cidPC sid
In DepthDetails US Patent
TargetCDK-activating kinase assembly factor MAT1/Cyclin-H/Cyclin-dependent kinase 7(Homo sapiens (Human))
Kinnate Biopharma
US Patent
LigandPNGBDBM572097((R)-N-(2-fluoro-4-(3-(quinazolin-2- ylamino)pyrrol...)
Affinity DataIC50:  550nM. Assay description: A radiometric protein kinase assay (33PanQinaseŽ Activity Assay) was used for measuring the kinase activity of the protein kinase. All kinase assays ...
Ligand InfoPC cidPC sid
In DepthDetails US Patent
TargetCyclin-A2/Cyclin-dependent kinase 2(Homo sapiens (Human))
Kinnate Biopharma
US Patent
LigandPNGBDBM572097((R)-N-(2-fluoro-4-(3-(quinazolin-2- ylamino)pyrrol...)
Affinity DataIC50:  5.50E+3nM. Assay description: A radiometric protein kinase assay (33PanQinaseŽ Activity Assay) was used for measuring the kinase activity of the protein kinase. All kinase assays ...
Ligand InfoPC cidPC sid
In DepthDetails US Patent
TargetCDK-activating kinase assembly factor MAT1/Cyclin-H/Cyclin-dependent kinase 7(Homo sapiens (Human))
Kinnate Biopharma
US Patent
LigandPNGBDBM572097((R)-N-(2-fluoro-4-(3-(quinazolin-2- ylamino)pyrrol...)
Affinity DataIC50:  550nM. Assay description: A radiometric protein kinase assay (33PanQinaseŽ Activity Assay) was used for measuring the kinase activity of the three protein kinases. All kinase ...
Ligand InfoPC cidPC sid
In DepthDetails US Patent
TargetCyclin-A2/Cyclin-dependent kinase 2(Homo sapiens (Human))
Kinnate Biopharma
US Patent
LigandPNGBDBM572097((R)-N-(2-fluoro-4-(3-(quinazolin-2- ylamino)pyrrol...)
Affinity DataIC50:  550nM. Assay description: A radiometric protein kinase assay (33PanQinaseŽ Activity Assay) was used for measuring the kinase activity of the three protein kinases. All kinase ...
Ligand InfoPC cidPC sid
In DepthDetails US Patent