BDBM573154 US11453673, Example 15
SMILES Cc1c(C)n2c(nnc2c(=O)n1CC1(C)CC1)C1(CC1)C1CC1
InChI Key InChIKey=LEQGDWSFJKSNPY-UHFFFAOYSA-N
Data  6 IC50
  Tab Delimited (TSV)   2D SDfile   Computed 3D by Vconf -m prep SDfile
Find this compound or compounds like it in BindingDB:
Activity Spreadsheet -- Enzyme Inhibition Constant Data from BindingDB
Found 6 hits for monomerid = 573154
LigandPNGBDBM573154(US11453673, Example 15)
Affinity DataIC50:  3.10nM. Assay description: TABLE 5: All 3′, 5′ cyclic nucleotide PDE enzyme activities are measured with a radiometric enzyme assay based on SPA detection system. C...
Ligand InfoPC cidPC sid
In DepthDetails US Patent
LigandPNGBDBM573154(US11453673, Example 15)
Affinity DataIC50:  4.90nM. Assay description: TABLE 5: All 3′, 5′ cyclic nucleotide PDE enzyme activities are measured with a radiometric enzyme assay based on SPA detection system. C...
Ligand InfoPC cidPC sid
In DepthDetails US Patent
TargetRod cGMP-specific 3',5'-cyclic phosphodiesterase subunit alpha/beta(Homo sapiens (Human))
Eli Lilly
US Patent
LigandPNGBDBM573154(US11453673, Example 15)
Affinity DataIC50: >1.00E+4nM. Assay description: Table 7: The following phosphodiesterase activities are measured using [3H]cGMP as reaction substrate: human PDE6A/6B. The catalytic active form of h...
Ligand InfoPC cidPC sid
In DepthDetails US Patent
TargetcGMP-inhibited 3',5'-cyclic phosphodiesterase 3A(Homo sapiens (Human))
Eli Lilly
US Patent
LigandPNGBDBM573154(US11453673, Example 15)
Affinity DataIC50:  9.60E+3nM. Assay description: Table 6: The following PDE activities are measured using [3H]cAMP as reaction substrate: human PDE3A (catalytic domain) and human PDE4D. Both enzymes...
Ligand InfoPC cidPC sid
In DepthDetails US Patent
TargetcAMP-specific 3',5'-cyclic phosphodiesterase 4D(Homo sapiens (Human))
Eli Lilly
US Patent
LigandPNGBDBM573154(US11453673, Example 15)
Affinity DataIC50:  1.40E+4nM. Assay description: Table 6: The following PDE activities are measured using [3H]cAMP as reaction substrate: human PDE3A (catalytic domain) and human PDE4D. Both enzymes...
Ligand InfoPC cidPC sid
In DepthDetails US Patent
LigandPNGBDBM573154(US11453673, Example 15)
Affinity DataIC50:  1.40nM. Assay description: TABLE 5: All 3′, 5′ cyclic nucleotide PDE enzyme activities are measured with a radiometric enzyme assay based on SPA detection system. C...
Ligand InfoPC cidPC sid
In DepthDetails US Patent