BDBM573400 US11453683, Example 259::US20230279025, Example 480
SMILES CCc1cccc2cc(O)cc(-c3ncc4c(nc(OC[C@@]56CCCN5C[C@H](F)C6)nc4c3F)N3CC4CCC(C3)N4)c12
InChI Key InChIKey=QZNGKEDSAWYQMJ-ADTQRWQWSA-N
Data  4 IC50
  Tab Delimited (TSV)   2D SDfile   Computed 3D by Vconf -m prep SDfile
Find this compound or compounds like it in BindingDB:
Activity Spreadsheet -- Enzyme Inhibition Constant Data from BindingDB
Found 4 hits for monomerid = 573400
TargetGTPase KRas [G12D](Homo sapiens (Human))
Mirati Therapeutics
US Patent
LigandPNGBDBM573400(US11453683, Example 259 | US20230279025, Example 4...)
Affinity DataIC50:  0.800nM. Assay description: This Example illustrates that exemplary compounds of the present invention inhibit the phosphorylation of ERK downstream of KRAS G12D. AGS cells (ATC...
Ligand InfoPC cidPC sid
In DepthDetails US Patent
TargetGTPase KRas [G12D](Homo sapiens (Human))
Mirati Therapeutics
US Patent
LigandPNGBDBM573400(US11453683, Example 259 | US20230279025, Example 4...)
Affinity DataIC50: <0.00200nM. Assay description: This Example illustrates that exemplary compounds of the present invention inhibit the phosphorylation of ERK downstream of KRAS G12D. AGS cells (ATC...
Ligand InfoPC cidPC sid
In DepthDetails US Patent
TargetGTPase KRas [G12D](Homo sapiens (Human))
Mirati Therapeutics
US Patent
LigandPNGBDBM573400(US11453683, Example 259 | US20230279025, Example 4...)
Affinity DataIC50:  3.90nM. Assay description: Table 2: The ability of a compound to bind to KRAS G12D was measured using a TR-FRET displacement assay. Biotinylated GDP-loaded recombinant human KR...
Ligand InfoPC cidPC sid
In DepthDetails US Patent
TargetGTPase KRas [G12D](Homo sapiens (Human))
Mirati Therapeutics
US Patent
LigandPNGBDBM573400(US11453683, Example 259 | US20230279025, Example 4...)
Affinity DataIC50:  0.800nM. Assay description: Table 2: The ability of a compound to bind to KRAS G12D was measured using a TR-FRET displacement assay. Biotinylated GDP-loaded recombinant human KR...
Ligand InfoPC cidPC sid
In DepthDetails US Patent