BDBM581373 US11505532, Compound WX008
SMILES Cc1noc(n1)-c1ccc(OC\C(CN)=C\F)cc1
InChI Key InChIKey=OMODCORQXRAZLW-UXBLZVDNSA-N
Data  1 IC50
  Tab Delimited (TSV)   2D SDfile   Computed 3D by Vconf -m prep SDfile
Find this compound or compounds like it in BindingDB:
Activity Spreadsheet -- Enzyme Inhibition Constant Data from BindingDB
Found 1 hit for monomerid = 581373
TargetMembrane primary amine oxidase(Homo sapiens (Human))
Shandong Danhong Pharmaceutical
US Patent
LigandPNGBDBM581373(US11505532, Compound WX008)
Affinity DataIC50:  0.400nM. Assay description: The inhibition of the sample on VAP-1 enzyme activity was measured by using an Amplex® Red Monoamine Oxidase kit (Invitrogen #A12214). 100 nL of the ...
Ligand InfoPC cidPC sid
In DepthDetails US Patent