BDBM581433 US11505532, Compound WX103
SMILES NC\C(COc1ccc(cc1)-c1nc(CC2CCCC2)n[nH]1)=C/F
InChI Key InChIKey=IZTGOTYSXLBTCC-GXDHUFHOSA-N
Data  1 IC50
  Tab Delimited (TSV)   2D SDfile   Computed 3D by Vconf -m prep SDfile
Find this compound or compounds like it in BindingDB:
Activity Spreadsheet -- Enzyme Inhibition Constant Data from BindingDB
Found 1 hit for monomerid = 581433
TargetMembrane primary amine oxidase(Homo sapiens (Human))
Shandong Danhong Pharmaceutical
US Patent
LigandPNGBDBM581433(US11505532, Compound WX103)
Affinity DataIC50:  0.200nM. Assay description: The inhibition of the sample on VAP-1 enzyme activity was measured by using an Amplex® Red Monoamine Oxidase kit (Invitrogen #A12214). 100 nL of the ...
Ligand InfoPC cidPC sid
In DepthDetails US Patent