BDBM581518 (2s,4s)-2-[2-(3-Cyclopropylphenyl)-7-azaspiro[3.5]nonane-7-carbonyl)-7-oxa-5- azaspiro[3.4]octan-6-one::US11505546, Example 5
SMILES O=C([C@H]1C[C@@]2(C1)COC(=O)N2)N1CCC2(CC(C2)c2cccc(c2)C2CC2)CC1
InChI Key InChIKey=CBKJQPGHUMTNKL-RZJSWYKGSA-N
Data  1 IC50
  Tab Delimited (TSV)   2D SDfile   Computed 3D by Vconf -m prep SDfile
Find this compound or compounds like it in BindingDB:
Activity Spreadsheet -- Enzyme Inhibition Constant Data from BindingDB
Found 1 hit for monomerid = 581518
TargetMonoglyceride lipase(Homo sapiens (Human))
Janssen Pharmaceutica
US Patent
LigandPNGBDBM581518((2s,4s)-2-[2-(3-Cyclopropylphenyl)-7-azaspiro[3.5]...)
Affinity DataIC50:  0.0880nM. Assay description: The assay used to measure the in vitro activity of MGL is adapted from the assay used for another serine hydrolase (FAAH) described in Wilson et al.,...
Ligand InfoPC cidPC sid
In DepthDetails US Patent