BDBM581913 WO2023003973, Compound 120
SMILES CC(C)c1cc(Cl)c2ccc(cc2n1)C(=O)NCCC[C@H](Cc1ccccc1)C(=O)N1CCC(O)(Cn2cnc3cc(OCCCN(C)C)ccc3c2=O)CC1
InChI Key InChIKey=OOUKMXBRQCNFGU-MGBGTMOVSA-N
Data  1 IC50
  Tab Delimited (TSV)   2D SDfile   Computed 3D by Vconf -m prep SDfile
Find this compound or compounds like it in BindingDB:
Activity Spreadsheet -- Enzyme Inhibition Constant Data from BindingDB
Found 1 hit for monomerid = 581913
TargetUbiquitin carboxyl-terminal hydrolase 7(Homo sapiens (Human))
Dana-Farber Cancer Institute
WIPO
LigandPNGBDBM581913(WO2023003973, Compound 120)
Affinity DataIC50: <20nM. Assay description: Dilute the compounds to 400 x of the final desired highest inhibitor concentration in reaction by 100% DMSO. For all compounds, transfer the compound...
Ligand InfoPC cidPC sid
In DepthDetails PubMed