BDBM589776 US11559538, Example 34
SMILES CCCOc1cc(ccc1OC)-c1cncc(c1)C1COB(O)C1
InChI Key InChIKey=KXVKOYCGACSUPP-UHFFFAOYSA-N
Data  4 IC50
  Tab Delimited (TSV)   2D SDfile   Computed 3D by Vconf -m prep SDfile
Find this compound or compounds like it in BindingDB:
Activity Spreadsheet -- Enzyme Inhibition Constant Data from BindingDB
Found 4 hits for monomerid = 589776
TargetIsoform PDE4B2 of cAMP-specific 3',5'-cyclic phosphodiesterase 4B(Homo sapiens (Human))
Pfizer
US Patent
LigandPNGBDBM589776(US11559538, Example 34)
Affinity DataIC50:  0.520nM. Assay description: Cytokine inhibitory activity is determined by measuring the effect of test agent on the release of the cytokines IL-4, IL-13 and IFNγ from human...
Ligand InfoPC cidPC sid
In DepthDetails US Patent
TargetInterferon gamma receptor 1(Homo sapiens (Human))
Pfizer
US Patent
LigandPNGBDBM589776(US11559538, Example 34)
Affinity DataIC50:  1.39nM
Ligand InfoPC cidPC sid
In DepthDetails US Patent
TargetInterleukin-4(Human)
Pfizer
US Patent
LigandPNGBDBM589776(US11559538, Example 34)
Affinity DataIC50:  14.3nM
Ligand InfoPC cidPC sid
In DepthDetails US Patent
TargetInterleukin-13(Human)
Pfizer
US Patent
LigandPNGBDBM589776(US11559538, Example 34)
Affinity DataIC50:  309nM
Ligand InfoPC cidPC sid
In DepthDetails US Patent