BDBM589825 US11559538, Example 81::US11559538, Example 82
SMILES CCCOc1c(OC)ccc(c1F)-c1cncc(c1)C1COB(O)C1
InChI Key InChIKey=MANABQSIOLMRPG-UHFFFAOYSA-N
Data  8 IC50
  Tab Delimited (TSV)   2D SDfile   Computed 3D by Vconf -m prep SDfile
Find this compound or compounds like it in BindingDB:
Activity Spreadsheet -- Enzyme Inhibition Constant Data from BindingDB
Found 8 hits for monomerid = 589825
TargetIsoform PDE4B2 of cAMP-specific 3',5'-cyclic phosphodiesterase 4B(Homo sapiens (Human))
Pfizer
US Patent
LigandPNGBDBM589825(US11559538, Example 81 | US11559538, Example 82)
Affinity DataIC50:  2.36nM. Assay description: Cytokine inhibitory activity is determined by measuring the effect of test agent on the release of the cytokines IL-4, IL-13 and IFNγ from human...
Ligand InfoPC cidPC sid
In DepthDetails US Patent
TargetInterleukin-13(Human)
Pfizer
US Patent
LigandPNGBDBM589825(US11559538, Example 81 | US11559538, Example 82)
Affinity DataIC50:  858nM
Ligand InfoPC cidPC sid
In DepthDetails US Patent
TargetInterleukin-4(Human)
Pfizer
US Patent
LigandPNGBDBM589825(US11559538, Example 81 | US11559538, Example 82)
Affinity DataIC50:  54.4nM
Ligand InfoPC cidPC sid
In DepthDetails US Patent
TargetInterferon gamma receptor 1(Homo sapiens (Human))
Pfizer
US Patent
LigandPNGBDBM589825(US11559538, Example 81 | US11559538, Example 82)
Affinity DataIC50:  1.07nM
Ligand InfoPC cidPC sid
In DepthDetails US Patent
TargetIsoform PDE4B2 of cAMP-specific 3',5'-cyclic phosphodiesterase 4B(Homo sapiens (Human))
Pfizer
US Patent
LigandPNGBDBM589825(US11559538, Example 81 | US11559538, Example 82)
Affinity DataIC50:  0.550nM. Assay description: Cytokine inhibitory activity is determined by measuring the effect of test agent on the release of the cytokines IL-4, IL-13 and IFNγ from human...
Ligand InfoPC cidPC sid
In DepthDetails US Patent
TargetInterleukin-13(Human)
Pfizer
US Patent
LigandPNGBDBM589825(US11559538, Example 81 | US11559538, Example 82)
Affinity DataIC50:  426nM
Ligand InfoPC cidPC sid
In DepthDetails US Patent
TargetInterleukin-4(Human)
Pfizer
US Patent
LigandPNGBDBM589825(US11559538, Example 81 | US11559538, Example 82)
Affinity DataIC50:  7.14nM
Ligand InfoPC cidPC sid
In DepthDetails US Patent
TargetInterferon gamma receptor 1(Homo sapiens (Human))
Pfizer
US Patent
LigandPNGBDBM589825(US11559538, Example 81 | US11559538, Example 82)
Affinity DataIC50:  1.62nM
Ligand InfoPC cidPC sid
In DepthDetails US Patent