BDBM592061 US11566013, Compound I-1
SMILES CSCn1c(ccc(N[C@@H](C)c2cc3cc(Cl)ccc3[nH]c2=O)c1=O)C#N
InChI Key InChIKey=HYPXGXVYLHFUKZ-NSHDSACASA-N
Data  2 IC50
  Tab Delimited (TSV)   2D SDfile   Computed 3D by Vconf -m prep SDfile
Find this compound or compounds like it in BindingDB:
Activity Spreadsheet -- Enzyme Inhibition Constant Data from BindingDB
Found 2 hits for monomerid = 592061
TargetIsocitrate dehydrogenase [NADP] cytoplasmic [R132C](Homo sapiens (Human))
Forma Therapeutics
US Patent
LigandPNGBDBM592061(US11566013, Compound I-1)
Affinity DataIC50:  12.9nM. Assay description: Assays were performed in a 384-well black plate. An aliquot of 250 nL of compound was incubated with 10 μL of 30 nM IDH1-R132H or 10 nM IDH1-R13...
Ligand InfoPC cidPC sid
In DepthDetails US Patent
TargetIsocitrate dehydrogenase [NADP] cytoplasmic [R132H](Homo sapiens (Human))
Forma Therapeutics
US Patent
LigandPNGBDBM592061(US11566013, Compound I-1)
Affinity DataIC50:  10nM. Assay description: Assays were performed in a 384-well black plate. An aliquot of 250 nL of compound was incubated with 10 μL of 30 nM IDH1-R132H or 10 nM IDH1-R13...
Ligand InfoPC cidPC sid
In DepthDetails US Patent