BDBM592138 US11572337, Compound 0MTK154
SMILES Oc1cc(O)c(C(=O)NCc2ccc(Oc3ccc(F)cc3)cc2)c(O)c1
InChI Key InChIKey=IOJBMYOEGBGUIF-UHFFFAOYSA-N
Data  2 IC50
  Tab Delimited (TSV)   2D SDfile   Computed 3D by Vconf -m prep SDfile
Find this compound or compounds like it in BindingDB:
Activity Spreadsheet -- Enzyme Inhibition Constant Data from BindingDB
Found 2 hits for monomerid = 592138
TargetDNA-directed RNA polymerase subunit beta'()
Rutgers, The State University of New Jersey
US Patent
LigandPNGBDBM592138(US11572337, Compound 0MTK154)
Affinity DataIC50:  3.50E+3nM. Assay description: Escherichia coli: Fluorescence-detected RNA polymerase assays with E.coli RNA polymerase were performed by a modification of the procedure of Khulman...
Ligand InfoPC cidPC sid
In DepthDetails US Patent
TargetDNA-directed RNA polymerase subunit beta(Escherichia coli)
Rutgers, The State University of New Jersey
US Patent
LigandPNGBDBM592138(US11572337, Compound 0MTK154)
Affinity DataIC50:  420nM. Assay description: Staphylococcus aureus: Fluorescence-detected RNA polymerase assays with S. aureus RNA polymerase were performed as in Example 2.1, using reaction mix...
Ligand InfoPC cidPC sid
In DepthDetails US Patent