BDBM59223 Pepstatin analog, 11
SMILES CC(C)C[C@@H](NC(=O)[C@H](NC(=O)CCCCCCCCCCCCCCC(=O)N[C@H](CC(N)=O)C(=O)N[C@@H](Cc1ccccc1)C(O)=O)C(C)O)C(=O)NCCc1ccc(Oc2ccccc2)cc1
InChI Key InChIKey=SIBURHFYVIIGBZ-BUDQIXAESA-N
Data  1 KI  1 IC50
  Tab Delimited (TSV)   2D SDfile   Computed 3D by Vconf -m prep SDfile
Find this compound or compounds like it in BindingDB:
Activity Spreadsheet -- Enzyme Inhibition Constant Data from BindingDB
Found 1 hit for monomerid = 59223
TargetCapsid scaffolding protein(Human herpesvirus 1 (strain 17) (HHV-1) (Human her...)
Purdue University
LigandPNGBDBM59223(Pepstatin analog, 11)
Affinity DataKi:  175nM IC50:  730nMpH: 5.52Assay Description:A zhang-poorman assay confirms a competitive inhibition mechanism or inhibit HIV-1 PR as a dimerization or mixed type inhibitor.
In DepthDetails ArticlePubMed