BDBM593702 US11578080, Example 8
SMILES Cc1c(sc2ncn(Cc3nnn(C[C@H](O)c4cc5ccc(Cl)cc5o4)n3)c(=O)c12)C(N)=O
InChI Key InChIKey=BMJPYMNIGZKPLS-LBPRGKRZSA-N
Data  1 IC50
  Tab Delimited (TSV)   2D SDfile   Computed 3D by Vconf -m prep SDfile
Find this compound or compounds like it in BindingDB:
Activity Spreadsheet -- Enzyme Inhibition Constant Data from BindingDB
Found 1 hit for monomerid = 593702
TargetTransient receptor potential cation channel subfamily A member 1(Homo sapiens (Human))
Boehringer Ingelheim International
US Patent
LigandPNGBDBM593702(US11578080, Example 8)
Affinity DataIC50:  15nM. Assay description: At the assay day cells were washed 3× with assay puffer, 20 μL buffer remained in the wells after washing. 10 μL Ca6 kit (Cat. R8191 Molecu...
Ligand InfoPC cidPC sid
In DepthDetails US Patent