BDBM59677 2,2,3,3-tetrafluoropropyl 2-({[5-(ethylthio)-1,3,4-thiadiazol-2-yl]amino}carbonyl)cyclohexanecarboxylate::2,2,3,3-tetrafluoropropyl 2-[(5-ethylsulfanyl-1,3,4-thiadiazol-2-yl)carbamoyl]cyclohexane-1-carboxylate::2,2,3,3-tetrakis(fluoranyl)propyl 2-[(5-ethylsulfanyl-1,3,4-thiadiazol-2-yl)carbamoyl]cyclohexane-1-carboxylate::2-[[5-(ethylthio)-1,3,4-thiadiazol-2-yl]carbamoyl]cyclohexanecarboxylic acid 2,2,3,3-tetrafluoropropyl ester::2-[[[5-(ethylthio)-1,3,4-thiadiazol-2-yl]amino]-oxomethyl]-1-cyclohexanecarboxylic acid 2,2,3,3-tetrafluoropropyl ester::MLS000085121::SMR000019661::cid_3242265
SMILES CCSc1nnc(NC(=O)C2CCCCC2C(=O)OCC(F)(F)C(F)F)s1
InChI Key InChIKey=XVACGDDLEMVDMO-UHFFFAOYSA-N
Data  1 IC50
  Tab Delimited (TSV)   2D SDfile   Computed 3D by Vconf -m prep SDfile
Find this compound or compounds like it in BindingDB:
Activity Spreadsheet -- Enzyme Inhibition Constant Data from BindingDB
Found 1 hit for monomerid = 59677
TargetM17 leucyl aminopeptidase(Plasmodium falciparum 3D7)
Srmlsc
Curated by PubChem BioAssay
LigandPNGBDBM59677(2,2,3,3-tetrafluoropropyl 2-({[5-(ethylthio)-1,3,4...)
Affinity DataIC50:  7.68E+4nM. Assay description: Southern Research Molecular Libraries Screening Center (SRMLSC) Southern Research Institute (Birmingham, Alabama) NIH Molecular Libraries Screening...
In DepthDetails PCBioAssay