BDBM600754 US11632953, Compound 12::VU0652942
SMILES FC(F)(F)c1nn(CC(=O)N2CCCC(C2)c2ccccc2)c2CCCCc12
InChI Key InChIKey=YWNAILVCKKYXBX-UHFFFAOYSA-N
Data  2 IC50
  Tab Delimited (TSV)   2D SDfile   Computed 3D by Vconf -m prep SDfile
Find this compound or compounds like it in BindingDB:
Activity Spreadsheet -- Enzyme Inhibition Constant Data from BindingDB
Found 2 hits for monomerid = 600754
TargetInward rectifier potassium channel 2(Homo sapiens (Human))
Board of Supervisors of Louisiana State University and Agricultural and Mechanical College
US Patent
LigandPNGBDBM600754(US11632953, Compound 12 | VU0652942)
Affinity DataIC50: >3.00E+4nM. Assay description: The thallium flux assay is an in vitro method of measuring conductance through a potassium ion channel. Potassium channels are also permeable to thal...
Ligand InfoPC cidPC sid
In DepthDetails US Patent
TargetAGAP001281-PB(African malaria mosquito)
Board of Supervisors of Louisiana State University and Agricultural and Mechanical College
US Patent
LigandPNGBDBM600754(US11632953, Compound 12 | VU0652942)
Affinity DataIC50:  5.60E+3nM. Assay description: The thallium flux assay is an in vitro method of measuring conductance through a potassium ion channel. Potassium channels are also permeable to thal...
Ligand InfoPC cidPC sid
In DepthDetails US Patent