BDBM601876 US11643396, Example MA4-022-1
SMILES CN1CCN(CC1)c1ccc(Nc2ncc(C)c(Nc3cccc(NS(=O)(=O)C(C)(C)C)c3)n2)cc1F
InChI Key InChIKey=OGJFKWUOCYNWAB-UHFFFAOYSA-N
Data  7 IC50
PDB links: 1 PDB ID matches this monomer.
  Tab Delimited (TSV)   2D SDfile   Computed 3D by Vconf -m prep SDfile
Find this compound or compounds like it in BindingDB:
Activity Spreadsheet -- Enzyme Inhibition Constant Data from BindingDB
Found 7 hits for monomerid = 601876
TargetBromodomain-containing protein 4(Homo sapiens (Human))
H. Lee Moffitt Cancer Center and Research Institute
US Patent
LigandPNGBDBM601876(US11643396, Example MA4-022-1)
Affinity DataIC50:  14nM. Assay description: AlphaScreen is a bead-based, non-radioactive Amplified Luminescent Proximity Homogeneous Assay. The details are not described in this patent.
Ligand InfoPC cidPC sidPDB
TargetBromodomain-containing protein 4(Homo sapiens (Human))
H. Lee Moffitt Cancer Center and Research Institute
US Patent
LigandPNGBDBM601876(US11643396, Example MA4-022-1)
Affinity DataIC50:  14nM. Assay description: AlphaScreen is a bead-based, non-radioactive Amplified Luminescent Proximity Homogeneous Assay. The details are not described in this patent.
Ligand InfoPC cidPC sidPDB
TargetBromodomain-containing protein 4(Homo sapiens (Human))
H. Lee Moffitt Cancer Center and Research Institute
US Patent
LigandPNGBDBM601876(US11643396, Example MA4-022-1)
Affinity DataIC50:  24.3nM. Assay description: AlphaScreen is a bead-based, non-radioactive Amplified Luminescent Proximity Homogeneous Assay. The details are not described in this patent.
Ligand InfoPC cidPC sidPDB
TargetReceptor-type tyrosine-protein kinase FLT3(Homo sapiens (Human))
H. Lee Moffitt Cancer Center and Research Institute
US Patent
LigandPNGBDBM601876(US11643396, Example MA4-022-1)
Affinity DataIC50:  146nM. Assay description: The HotSpot Kinase Assay is used at our US facility for compound screening on protein kinases.
Ligand InfoPC cidPC sidPDB
In DepthDetails US Patent
TargetTyrosine-protein kinase JAK1(Homo sapiens (Human))
H. Lee Moffitt Cancer Center and Research Institute
US Patent
LigandPNGBDBM601876(US11643396, Example MA4-022-1)
Affinity DataIC50:  1.14nM. Assay description: The HotSpot Kinase Assay is used at our US facility for compound screening on protein kinases.
Ligand InfoPC cidPC sidPDB
In DepthDetails US Patent
TargetReceptor-type tyrosine-protein kinase FLT3(Homo sapiens (Human))
H. Lee Moffitt Cancer Center and Research Institute
US Patent
LigandPNGBDBM601876(US11643396, Example MA4-022-1)
Affinity DataIC50:  1.10nM. Assay description: The HotSpot Kinase Assay is used at our US facility for compound screening on protein kinases.
Ligand InfoPC cidPC sidPDB
In DepthDetails US Patent
TargetBromodomain testis-specific protein(Homo sapiens (Human))
H. Lee Moffitt Cancer Center and Research Institute
US Patent
LigandPNGBDBM601876(US11643396, Example MA4-022-1)
Affinity DataIC50:  41.3nM. Assay description: AlphaScreen is a bead-based, non-radioactive Amplified Luminescent Proximity Homogeneous Assay. The details are not described in this patent.
Ligand InfoPC cidPC sidPDB
In DepthDetails US Patent