BDBM611028 US10626108, Compound 28
SMILES Fc1cc(F)c2[nH]cc(-c3nncc(N[C@@H]4CCC[C@@H](C4)NC(=O)N4CCCC4)n3)c2c1
InChI Key
Data  1 IC50
  Tab Delimited (TSV)   2D SDfile   Computed 3D by Vconf -m prep SDfile
Find this compound or compounds like it in BindingDB:
Activity Spreadsheet -- Enzyme Inhibition Constant Data from BindingDB
Found 1 hit for monomerid = 611028
TargetHemagglutinin()
Janssen Sciences Ireland Uc
US Patent
LigandPNGBDBM611028(US10626108, Compound 28)
Affinity DataIC50:  8nM. Assay description: The in vitro antiviral activity of the compounds was determined using a cell-based antiviral assay. In this assay, the cytopathic effect (CPE) in Mad...
Ligand InfoPC cidPC sid
In DepthDetails US Patent