BDBM611029 US10626108, Compound 29
SMILES Cc1nc(nc(N[C@H]2CCC[C@H](C2)NC(=O)c2csc(n2)C(O)=O)c1F)-c1c[nH]c2c(F)cc(F)cc12
InChI Key
Data  1 IC50
  Tab Delimited (TSV)   2D SDfile   Computed 3D by Vconf -m prep SDfile
Find this compound or compounds like it in BindingDB:
Activity Spreadsheet -- Enzyme Inhibition Constant Data from BindingDB
Found 1 hit for monomerid = 611029
TargetHemagglutinin()
Janssen Sciences Ireland Uc
US Patent
LigandPNGBDBM611029(US10626108, Compound 29)
Affinity DataIC50:  2nM. Assay description: The in vitro antiviral activity of the compounds was determined using a cell-based antiviral assay. In this assay, the cytopathic effect (CPE) in Mad...
Ligand InfoPC cidPC sid
In DepthDetails US Patent