BDBM611056 US10626108, Compound 36
SMILES OC(=O)c1nc(nc(N[C@@H]2CCC[C@@H](C2)NC(=O)c2cnn[nH]2)c1F)-c1c[nH]c2c(F)cc(F)cc12
InChI Key
Data  1 IC50
  Tab Delimited (TSV)   2D SDfile   Computed 3D by Vconf -m prep SDfile
Find this compound or compounds like it in BindingDB:
Activity Spreadsheet -- Enzyme Inhibition Constant Data from BindingDB
Found 1 hit for monomerid = 611056
TargetHemagglutinin()
Janssen Sciences Ireland Uc
US Patent
LigandPNGBDBM611056(US10626108, Compound 36)
Affinity DataIC50:  7nM. Assay description: The in vitro antiviral activity of the compounds was determined using a cell-based antiviral assay. In this assay, the cytopathic effect (CPE) in Mad...
Ligand InfoPC cidPC sid
In DepthDetails US Patent