BDBM611534 US10626144, Compound Odilomycin A
SMILES NCCCCNC(=O)[C@H](CCC(O)CN)NC(=O)C(\NC(=O)[C@H](CCC(O)CN)NC(=O)[C@H](Cc1cnc[nH]1)NC(=O)[C@@H]1CCCN1C(=O)[C@@H](CCCN)NC(=O)CNC(=O)[C@@H](NC(=O)[C@@H](NC(=O)[C@@H](N)CCCCN)[C@@H](O)CN)[C@@H](O)CN)=C\CCN=C(N)N
InChI Key InChIKey=ZDDTZHKHBWNHBP-SYONOHKHSA-N
Data  1 IC50
  Tab Delimited (TSV)   2D SDfile   Computed 3D by Vconf -m prep SDfile
Find this compound or compounds like it in BindingDB:
Activity Spreadsheet -- Enzyme Inhibition Constant Data from BindingDB
Found 1 hit for monomerid = 611534
TargetVoltage-dependent N-type calcium channel subunit alpha-1B(Homo sapiens (Human))
Nosopharm
US Patent
LigandPNGBDBM611534(US10626144, Compound Odilomycin A)
Affinity DataIC50:  25nM. Assay description: Interaction with N-type calcium channels was assessed with radiolabelled a competitive binding assay, applying the procedure described by Wagner et a...
Ligand InfoPC cidPC sid
In DepthDetails US Patent