BDBM616938 US20230279025, Example 26::US20230279025, Example 461
SMILES Oc1cc(-c2ncc3c(nc(OCCN4C[C@@H]5C[C@H]4CO5)nc3c2F)N2CC3CCC(C2)N3)c2ccccc2c1
InChI Key InChIKey=OQUSFGODZLOBKA-IRIHCNEDSA-N
Data  2 IC50  1 Kd
  Tab Delimited (TSV)   2D SDfile   Computed 3D by Vconf -m prep SDfile
Find this compound or compounds like it in BindingDB:
Activity Spreadsheet -- Enzyme Inhibition Constant Data from BindingDB
Found 3 hits for monomerid = 616938
TargetGTPase KRas [G12D](Homo sapiens (Human))
Mirati Therapeutics
US Patent
LigandPNGBDBM616938(US20230279025, Example 26 | US20230279025, Example...)
Affinity DataIC50:  0.0620nM. Assay description: This Example illustrates that exemplary compounds of the present invention inhibit the phosphorylation of ERK downstream of KRAS G12D. AGS cells (ATC...
Ligand InfoPC cidPC sid
In DepthDetails US Patent
TargetGTPase KRas [G12D](Homo sapiens (Human))
Mirati Therapeutics
US Patent
LigandPNGBDBM616938(US20230279025, Example 26 | US20230279025, Example...)
Affinity DataKd:  27.9nM. Assay description: Briefly, 1L of 1.05X HBS-Mg buffer (262.5 mM Bioultra Hepes, pH 7.5, 157.5 mM NaCl, 105 mM MgCl2, 0.525 mM TCEP, 0.0305% Brij-35) was prepared and fi...
Ligand InfoPC cidPC sid
In DepthDetails US Patent
TargetGTPase KRas [G12D](Homo sapiens (Human))
Mirati Therapeutics
US Patent
LigandPNGBDBM616938(US20230279025, Example 26 | US20230279025, Example...)
Affinity DataIC50:  42.1nM. Assay description: This Example illustrates that exemplary compounds of the present invention inhibit the phosphorylation of ERK downstream of KRAS G12D. AGS cells (ATC...
Ligand InfoPC cidPC sid
In DepthDetails US Patent