BDBM617349 US20230279025, Example 465
SMILES CCc1cccc2cccc(-c3ncc4c(nc(OC[C@@]56CCCN5C[C@H](F)C6)nc4c3F)N3CC4CCC(C3)N4)c12
InChI Key InChIKey=HVGHCNSFVMLVQU-NWGATINRSA-N
Data  1 IC50
  Tab Delimited (TSV)   2D SDfile   Computed 3D by Vconf -m prep SDfile
Find this compound or compounds like it in BindingDB:
Activity Spreadsheet -- Enzyme Inhibition Constant Data from BindingDB
Found 1 hit for monomerid = 617349
TargetGTPase KRas [G12D](Homo sapiens (Human))
Mirati Therapeutics
US Patent
LigandPNGBDBM617349(US20230279025, Example 465)
Affinity DataIC50:  0.00100nM. Assay description: This Example illustrates that exemplary compounds of the present invention inhibit the phosphorylation of ERK downstream of KRAS G12D. AGS cells (ATC...
Ligand InfoPC cidPC sid
In DepthDetails US Patent