BDBM617357 US20230279025, Example 469
SMILES Oc1cc(-c2ncc3c(nc(OC[C@]45C[C@@H](F)CN4CCCC5)nc3c2F)N2CC3CCC(C2)N3)c2c(C#C)c(F)ccc2c1
InChI Key InChIKey=QABXWIYGHIIXHW-OHAKLNMTSA-N
Data  1 IC50
  Tab Delimited (TSV)   2D SDfile   Computed 3D by Vconf -m prep SDfile
Find this compound or compounds like it in BindingDB:
Activity Spreadsheet -- Enzyme Inhibition Constant Data from BindingDB
Found 1 hit for monomerid = 617357
TargetGTPase KRas [G12D](Homo sapiens (Human))
Mirati Therapeutics
US Patent
LigandPNGBDBM617357(US20230279025, Example 469)
Affinity DataIC50: <0.00200nM. Assay description: This Example illustrates that exemplary compounds of the present invention inhibit the phosphorylation of ERK downstream of KRAS G12D. AGS cells (ATC...
Ligand InfoPC cidPC sid
In DepthDetails US Patent