BDBM6266 8-Cyclopentyl-2-[4-(2-diethylaminoethoxy)phenylamino]-8H-pyrido[2,3-d]pyrimidin-7-one::8-cyclopentyl-2-({4-[2-(diethylamino)ethoxy]phenyl}amino)-7H,8H-pyrido[2,3-d]pyrimidin-7-one::N8 Pyrido[2,3-d]pyrimidin-7-one deriv. 58
SMILES CCN(CC)CCOc1ccc(Nc2ncc3ccc(=O)n(C4CCCC4)c3n2)cc1
InChI Key InChIKey=YYZJJQLIOBCYAE-UHFFFAOYSA-N
Data  1 IC50
  Tab Delimited (TSV)   2D SDfile   Computed 3D by Vconf -m prep SDfile
Find this compound or compounds like it in BindingDB:
Activity Spreadsheet -- Enzyme Inhibition Constant Data from BindingDB
Found 1 hit for monomerid = 6266
TargetCyclin-dependent kinase 4/G1/S-specific cyclin-D1 [L188C](Homo sapiens (Human))
Parke-Davis Pharmaceutical Research
LigandPNGBDBM6266(8-Cyclopentyl-2-[4-(2-diethylaminoethoxy)phenylami...)
Affinity DataIC50:  0.700nM. Assay description: The enzyme was assayed with substrate GST- retinoblastoma in the presence of 25 uM ATP/[gamma-32P] ATP. IC50 is the inhibitor concentration, which in...
In DepthDetails ArticlePubMed