BDBM635735 US20230365488, Compound 1b
SMILES COc1ccccc1C1[C@H]([C@H]([C@@H]1C(=O)Oc1cc(ccc1C#N)-c1ccccc1)c1ccccc1OC)C(O)=O
InChI Key InChIKey=MXZNOPMNXOIECX-YBZGMHNUSA-N
Data  3 KI
  Tab Delimited (TSV)   2D SDfile   Computed 3D by Vconf -m prep SDfile
Find this compound or compounds like it in BindingDB:
Activity Spreadsheet -- Enzyme Inhibition Constant Data from BindingDB
Found 3 hits for monomerid = 635735
TargetFatty acid-binding protein 5(Homo sapiens (Human))
The Research Foundation For The State University of New York
US Patent
LigandPNGBDBM635735(US20230365488, Compound 1b)
Affinity DataKi:  330nM. Assay description: Purified FABPs (3 μM) were incubated with fluorescent probe (500 nM) in 30 mM Tris, 100 mM NaCl buffer (pH 7.5). Compounds to be tested were the...
Ligand InfoPC cidPC sid
In DepthDetails US Patent
TargetFatty acid-binding protein, brain(Homo sapiens)
The Research Foundation For The State University of New York
US Patent
LigandPNGBDBM635735(US20230365488, Compound 1b)
Affinity DataKi:  960nM. Assay description: Purified FABPs (3 μM) were incubated with fluorescent probe (500 nM) in 30 mM Tris, 100 mM NaCl buffer (pH 7.5). Compounds to be tested were the...
Ligand InfoPC cidPC sid
In DepthDetails US Patent
TargetFABP3 protein(Human)
The Research Foundation For The State University of New York
US Patent
LigandPNGBDBM635735(US20230365488, Compound 1b)
Affinity DataKi:  1.60E+3nM. Assay description: Purified FABPs (3 μM) were incubated with fluorescent probe (500 nM) in 30 mM Tris, 100 mM NaCl buffer (pH 7.5). Compounds to be tested were the...
Ligand InfoPC cidPC sid
In DepthDetails US Patent