BDBM635745 US20230365488, Compound 1c
SMILES OC(=O)[C@@H]1C([C@H]([C@@H]1c1ccccc1)C(=O)Oc1cccc(c1)-c1ccc2OCOc2c1)c1ccccc1
InChI Key InChIKey=IJWQNCDNGRURFR-POQGNYHUSA-N
Data  3 KI
  Tab Delimited (TSV)   2D SDfile   Computed 3D by Vconf -m prep SDfile
Find this compound or compounds like it in BindingDB:
Activity Spreadsheet -- Enzyme Inhibition Constant Data from BindingDB
Found 3 hits for monomerid = 635745
TargetFatty acid-binding protein 5(Homo sapiens (Human))
The Research Foundation For The State University of New York
US Patent
LigandPNGBDBM635745(US20230365488, Compound 1c)
Affinity DataKi:  360nM. Assay description: Purified FABPs (3 μM) were incubated with fluorescent probe (500 nM) in 30 mM Tris, 100 mM NaCl buffer (pH 7.5). Compounds to be tested were the...
Ligand InfoPC cidPC sid
In DepthDetails US Patent
TargetFatty acid-binding protein, brain(Homo sapiens)
The Research Foundation For The State University of New York
US Patent
LigandPNGBDBM635745(US20230365488, Compound 1c)
Affinity DataKi:  570nM. Assay description: Purified FABPs (3 μM) were incubated with fluorescent probe (500 nM) in 30 mM Tris, 100 mM NaCl buffer (pH 7.5). Compounds to be tested were the...
Ligand InfoPC cidPC sid
In DepthDetails US Patent
TargetFABP3 protein(Human)
The Research Foundation For The State University of New York
US Patent
LigandPNGBDBM635745(US20230365488, Compound 1c)
Affinity DataKi:  6.00E+3nM. Assay description: Purified FABPs (3 μM) were incubated with fluorescent probe (500 nM) in 30 mM Tris, 100 mM NaCl buffer (pH 7.5). Compounds to be tested were the...
Ligand InfoPC cidPC sid
In DepthDetails US Patent