BDBM637112 US20230382904, Compound 32
SMILES Nc1nc2c(cc(cn2n1)-c1csc(c1)C(=O)NCc1ccc(F)cc1)C(=O)NC1CNC(=O)C1
InChI Key InChIKey=WMKWBCPSWSWXNF-UHFFFAOYSA-N
Data  2 IC50
  Tab Delimited (TSV)   2D SDfile   Computed 3D by Vconf -m prep SDfile
Find this compound or compounds like it in BindingDB:
Activity Spreadsheet -- Enzyme Inhibition Constant Data from BindingDB
Found 2 hits for monomerid = 637112
TargetMitogen-activated protein kinase kinase kinase 13(Homo sapiens (Human))
The Johns Hopkins University
US Patent
LigandPNGBDBM637112(US20230382904, Compound 32)
Affinity DataIC50:  78nM. Assay description: Assay Protocol for 384 low volume MTP format: 1 μl of test compound was pipetted into test plate; +5 μl LZK solution (10 nM LZK, catalytic ...
Ligand InfoPC cidPC sid
In DepthDetails US Patent
TargetProtein delta homolog 1(Homo sapiens (Human))
The Johns Hopkins University
US Patent
LigandPNGBDBM637112(US20230382904, Compound 32)
Affinity DataIC50:  6.5nM. Assay description: Assay Protocol for 1536 MTP format: test compounds were predispensed (60 nl) in test plates; +3 μl DLK solution (10 nM DLK, catalytic domain, Ca...
Ligand InfoPC cidPC sid
In DepthDetails US Patent