BDBM637187 US20230382904, Compound 107
SMILES COC[C@H](NC(=O)c1cc(cs1)-c1cc(C(=O)N[C@H]2CCOC2)c2nc(N)nn2c1)c1ccccc1
InChI Key InChIKey=QQWVKTNSZANSFF-ICSRJNTNSA-N
Data  2 IC50
  Tab Delimited (TSV)   2D SDfile   Computed 3D by Vconf -m prep SDfile
Find this compound or compounds like it in BindingDB:
Activity Spreadsheet -- Enzyme Inhibition Constant Data from BindingDB
Found 2 hits for monomerid = 637187
TargetMitogen-activated protein kinase kinase kinase 13(Homo sapiens (Human))
The Johns Hopkins University
US Patent
LigandPNGBDBM637187(US20230382904, Compound 107)
Affinity DataIC50:  46nM. Assay description: Assay Protocol for 384 low volume MTP format: 1 μl of test compound was pipetted into test plate; +5 μl LZK solution (10 nM LZK, catalytic ...
Ligand InfoPC cidPC sid
In DepthDetails US Patent
TargetProtein delta homolog 1(Homo sapiens (Human))
The Johns Hopkins University
US Patent
LigandPNGBDBM637187(US20230382904, Compound 107)
Affinity DataIC50:  5.5nM. Assay description: Assay Protocol for 1536 MTP format: test compounds were predispensed (60 nl) in test plates; +3 μl DLK solution (10 nM DLK, catalytic domain, Ca...
Ligand InfoPC cidPC sid
In DepthDetails US Patent