BDBM642840 US11858905, Compound 40
SMILES CC1(CC1)c1cc(C(=O)N[C@@H](Cc2nc3ccc(cc3o2)C2=CCN(CC(F)F)CC2)C(=O)NC2(CC2)C#N)n(n1)C1CC1
InChI Key InChIKey=SQRKCUPJESGSRO-QHCPKHFHSA-N
Data  1 IC50
  Tab Delimited (TSV)   2D SDfile   Computed 3D by Vconf -m prep SDfile
Find this compound or compounds like it in BindingDB:
Activity Spreadsheet -- Enzyme Inhibition Constant Data from BindingDB
Found 1 hit for monomerid = 642840
TargetProcathepsin L(Homo sapiens (Human))
Biofront Therapeutics (Beijing) Co.
US Patent
LigandPNGBDBM642840(US11858905, Compound 40)
Affinity DataIC50:  1.5nM. Assay description: Human cathepsin L enzymatic assay was performed in assay buffer (50 mM MES pH 5.5, 2.5 mM DTT, 0.5 mM EDTA) to assess the inhibition of human CatL by...
Ligand InfoPC cidPC sid
In DepthDetails US Patent