BDBM642877 (2S,4aS,6aS,6bR,8aR,9S,10S,12aS,12bR,14bR)-2,4a,6a,6b,9,12a-hexamethyl-10-{[2-(methylsulfanyl)acetyl]oxy}-13-oxo-9-({[2-oxo-5-(propan-2-yl)-2H-1,3-dioxol-4-yl]methoxy}carbonyl)-1,2,3,4,4a,5,6,6a,6b,7,8,8a,9,10,11,12,12a,12b,13,14b-icosahydropicene-2-carboxylic acid::US11858959, Compound 701-1
SMILES CSCC(=O)O[C@H]1CC[C@@]2(C)[C@@H](CC[C@]3(C)[C@@H]2C(=O)C=C2[C@@H]4C[C@](C)(CC[C@]4(C)CC[C@@]32C)C(O)=O)[C@]1(C)C(=O)OCc1oc(=O)oc1C(C)C
InChI Key InChIKey=WTEMXJJQNQSDJG-YYDDGKOJSA-N
Data  1 IC50
  Tab Delimited (TSV)   2D SDfile   Computed 3D by Vconf -m prep SDfile
Find this compound or compounds like it in BindingDB:
Activity Spreadsheet -- Enzyme Inhibition Constant Data from BindingDB
Found 1 hit for monomerid = 642877
Target11-beta-hydroxysteroid dehydrogenase type 2(Homo sapiens (Human))
Ardelyx
US Patent
LigandPNGBDBM642877((2S,4aS,6aS,6bR,8aR,9S,10S,12aS,12bR,14bR)-2,4a,6a...)
Affinity DataIC50:  100nM. Assay description: Human descending colon epithelial stem cells were cultured as 3D organoids in accordance with Sato et al Gastroenterology. 2011 November; 141(5): 176...
Ligand InfoPC cidPC sid
In DepthDetails US Patent