BDBM642913 (2S,4aS,6aS,6bR,8aR,9S,10S,12aS,12bR,14bR)-10-[4-(ethoxycarbonyl)-5-methoxy-1H-pyrazol-1-yl]-2,4a,6a,6b,9,12a-hexamethyl-9-{[(5-methyl-2-oxo-2H-1,3-dioxol-4-yl)methoxy]carbonyl}-13-oxo-1,2,3,4,4a,5,6,6a,6b,7,8,8a,9,10,11,12,12a,12b,13,14b-icosahydropicene-2-carboxylic acid::US11858959, Compound 713-1
SMILES CCOC(=O)c1cnn([C@H]2CC[C@@]3(C)[C@@H](CC[C@]4(C)[C@@H]3C(=O)C=C3[C@@H]5C[C@](C)(CC[C@]5(C)CC[C@@]43C)C(O)=O)[C@]2(C)C(=O)OCc2oc(=O)oc2C)c1OC
InChI Key InChIKey=HSJFXFMJSGPMQM-NODWQRKRSA-N
Data  1 IC50
  Tab Delimited (TSV)   2D SDfile   Computed 3D by Vconf -m prep SDfile
Find this compound or compounds like it in BindingDB:
Activity Spreadsheet -- Enzyme Inhibition Constant Data from BindingDB
Found 1 hit for monomerid = 642913
Target11-beta-hydroxysteroid dehydrogenase type 2(Homo sapiens (Human))
Ardelyx
US Patent
LigandPNGBDBM642913((2S,4aS,6aS,6bR,8aR,9S,10S,12aS,12bR,14bR)-10-[4-(...)
Affinity DataIC50:  126nM. Assay description: Human descending colon epithelial stem cells were cultured as 3D organoids in accordance with Sato et al Gastroenterology. 2011 November; 141(5): 176...
Ligand InfoPC cidPC sid
In DepthDetails US Patent