BDBM65856 3-chloranyl-4-(1-ethylbenzimidazol-2-yl)sulfanyl-aniline::3-chloro-4-(1-ethylbenzimidazol-2-yl)sulfanylaniline::3-chloro-4-[(1-ethyl-1H-benzimidazol-2-yl)thio]aniline::3-chloro-4-[(1-ethyl-2-benzimidazolyl)thio]aniline::MLS000050654::SMR000078102::[3-chloro-4-[(1-ethylbenzimidazol-2-yl)thio]phenyl]amine::cid_973685
SMILES CCn1c(Sc2ccc(N)cc2Cl)nc2ccccc12
InChI Key InChIKey=FDLVLPJOYWAMMU-UHFFFAOYSA-N
Data  1 IC50
  Tab Delimited (TSV)   2D SDfile   Computed 3D by Vconf -m prep SDfile
Find this compound or compounds like it in BindingDB:
Activity Spreadsheet -- Enzyme Inhibition Constant Data from BindingDB
Found 1 hit for monomerid = 65856
TargetInward rectifier potassium channel 2(Mus musculus)
Johns Hopkins Ion Channel Center
Curated by PubChem BioAssay
LigandPNGBDBM65856(3-chloranyl-4-(1-ethylbenzimidazol-2-yl)sulfanyl-a...)
Affinity DataIC50:  3.56E+4nM. Assay description: Data Source: Johns Hopkins Ion Channel Center (JHICC) BioAssay Type: Confirmatory, Confirmatory Screening, Multiple Concentration Activity Observed. ...
In DepthDetails PCBioAssay